Reaction Details
TargetBeta-2 adrenergic receptor
LigandBDBM50328332
Substrate/Competitorn/a
Meas. Tech.ChEMBL_665492 (CHEMBL1261323)
Ki 68±n/a nM
Citation Tasler, SBaumgartner, RAmmendola, ASchachtner, JWieber, TBlisse, MRath, SZaja, MKlahn, PQuotschalla, UNey, P Thienopyrimidines asß3-adrenoceptor agonists: hit-to-lead optimization. Bioorg Med Chem Lett20:6108-15 (2010) 
 
Beta-2 adrenergic receptor
Name:Beta-2 adrenergic receptor
Type:n/a
Mol. Mass.:46461.69
Organism:Homo sapiens (Human)
Description:P07550
Residue:413
BDBM50328332
NameBDBM50328332
Synonyms:1-(1-(5-phenylthieno[2,3-d]pyrimidin-4-yl)piperidin-4-ylamino)-3-(3-(trifluoromethoxy)phenoxy)propan-2-ol | CHEMBL1258142
TypeSmall organic molecule
Emp. Form.C27H27F3N4O3S
Mol. Mass.544.588
SMILESOC(CNC1CCN(CC1)c1ncnc2scc(-c3ccccc3)c12)COc1cccc(OC(F)(F)F)c1