Reaction Details
TargetBeta-3 adrenergic receptor
LigandBDBM50328296
Substrate/Competitorn/a
Meas. Tech.ChEMBL_665493 (CHEMBL1261324)
Ki 23±n/a nM
Citation Tasler, SBaumgartner, RAmmendola, ASchachtner, JWieber, TBlisse, MRath, SZaja, MKlahn, PQuotschalla, UNey, P Thienopyrimidines asß3-adrenoceptor agonists: hit-to-lead optimization. Bioorg Med Chem Lett20:6108-15 (2010) 
 
Beta-3 adrenergic receptor
Name:Beta-3 adrenergic receptor
Type:G Protein-Coupled Receptor (GPCR)
Mol. Mass.:43534.88
Organism:Homo sapiens (Human)
Description:n/a
Residue:408
BDBM50328296
NameBDBM50328296
Synonyms:1-(1-(5-(4-fluorophenyl)thieno[2,3-d]pyrimidin-4-yl)piperidin-4-ylamino)-3-phenoxypropan-2-ol | CHEMBL1257915
TypeSmall organic molecule
Emp. Form.C26H27FN4O2S
Mol. Mass.478.582
SMILESOC(CNC1CCN(CC1)c1ncnc2scc(-c3ccc(F)cc3)c12)COc1ccccc1