Reaction Details
TargetBeta-3 adrenergic receptor
LigandBDBM50328333
Substrate/Competitorn/a
Meas. Tech.ChEMBL_665493 (CHEMBL1261324)
EC50 21±n/a nM
Citation Tasler, SBaumgartner, RAmmendola, ASchachtner, JWieber, TBlisse, MRath, SZaja, MKlahn, PQuotschalla, UNey, P Thienopyrimidines asß3-adrenoceptor agonists: hit-to-lead optimization. Bioorg Med Chem Lett20:6108-15 (2010) 
 
Beta-3 adrenergic receptor
Name:Beta-3 adrenergic receptor
Type:G Protein-Coupled Receptor (GPCR)
Mol. Mass.:43534.88
Organism:Homo sapiens (Human)
Description:n/a
Residue:408
BDBM50328333
NameBDBM50328333
Synonyms:1-(3-methoxyphenoxy)-3-(1-(5-phenylthieno[2,3-d]pyrimidin-4-yl)piperidin-4-ylamino)propan-2-ol | CHEMBL1258024
TypeSmall organic molecule
Emp. Form.C27H30N4O3S
Mol. Mass.490.617
SMILESCOc1cccc(OCC(O)CNC2CCN(CC2)c2ncnc3scc(-c4ccccc4)c23)c1