Reaction Details
TargetBeta-1 adrenergic receptor
LigandBDBM50328282
Substrate/Competitorn/a
Meas. Tech.ChEMBL_665487 (CHEMBL1261318)
Ki 30±n/a nM
Citation Tasler, SBaumgartner, RAmmendola, ASchachtner, JWieber, TBlisse, MRath, SZaja, MKlahn, PQuotschalla, UNey, P Thienopyrimidines asß3-adrenoceptor agonists: hit-to-lead optimization. Bioorg Med Chem Lett20:6108-15 (2010) 
 
Beta-1 adrenergic receptor
Name:Beta-1 adrenergic receptor
Type:G Protein-Coupled Receptor (GPCR)
Mol. Mass.:51338.40
Organism:Homo sapiens (Human)
Description:P08588
Residue:477
BDBM50328282
NameBDBM50328282
Synonyms:1-phenoxy-3-(1-(thieno[3,2-d]pyrimidin-4-yl)piperidin-4-ylamino)propan-2-ol | CHEMBL1258599
TypeSmall organic molecule
Emp. Form.C20H24N4O2S
Mol. Mass.384.495
SMILESOC(CNC1CCN(CC1)c1ncnc2ccsc12)COc1ccccc1