Reaction Details
TargetReceptor-type tyrosine-protein kinase FLT3
LigandBDBM50328397
Substrate/Competitorn/a
Meas. Tech.ChEMBL_665527 (CHEMBL1261358)
IC50>1000±n/a nM
Citation Chen, CHLee, OYao, CNChuang, MYChang, YLChang, MHWen, YFYang, WHKo, CHChou, NTLin, MWLai, CPSun, CYWang, LMChen, YCHseu, THChang, CNHsu, HCLin, HCChang, YLShih, YCChou, SHHsu, YLTseng, HWLiu, CPTu, CMHu, TLTsai, YJChen, TSLin, CLChiou, SJLiu, CCHwang, CS Novel azulene-based derivatives as potent multi-receptor tyrosine kinase inhibitors. Bioorg Med Chem Lett20:6129-32 (2010) 
 
Receptor-type tyrosine-protein kinase FLT3
Name:Receptor-type tyrosine-protein kinase FLT3
Type:Enzyme
Mol. Mass.:112888.62
Organism:Homo sapiens (Human)
Description:P36888
Residue:993
BDBM50328397
NameBDBM50328397
Synonyms:(E)-3-((3-methylazulen-1-yl)methylene)indolin-2-one | CHEMBL1257683
TypeSmall organic molecule
Emp. Form.C20H15NO
Mol. Mass.285.3392
SMILESCc1cc(\C=C2\C(=O)Nc3ccccc23)c2cccccc12