Reaction Details
TargetReceptor-type tyrosine-protein kinase FLT3
LigandBDBM50328411
Substrate/Competitorn/a
Meas. Tech.ChEMBL_665527 (CHEMBL1261358)
IC50 86±n/a nM
Citation Chen, CHLee, OYao, CNChuang, MYChang, YLChang, MHWen, YFYang, WHKo, CHChou, NTLin, MWLai, CPSun, CYWang, LMChen, YCHseu, THChang, CNHsu, HCLin, HCChang, YLShih, YCChou, SHHsu, YLTseng, HWLiu, CPTu, CMHu, TLTsai, YJChen, TSLin, CLChiou, SJLiu, CCHwang, CS Novel azulene-based derivatives as potent multi-receptor tyrosine kinase inhibitors. Bioorg Med Chem Lett20:6129-32 (2010) 
 
Receptor-type tyrosine-protein kinase FLT3
Name:Receptor-type tyrosine-protein kinase FLT3
Type:Enzyme
Mol. Mass.:112888.62
Organism:Homo sapiens (Human)
Description:P36888
Residue:993
BDBM50328411
NameBDBM50328411
Synonyms:(Z)-5-bromo-3-((3-methyl-4-(3-morpholinopropoxy)azulen-1-yl)methylene)-1H-pyrrolo[2,3-b]pyridin-2(3H)-one | CHEMBL1258489
TypeSmall organic molecule
Emp. Form.C26H26BrN3O3
Mol. Mass.508.407
SMILESCc1cc(\C=C2/C(=O)Nc3ncc(Br)cc23)c2ccccc(OCCCN3CCOCC3)c12