Reaction Details
TargetReceptor-type tyrosine-protein kinase FLT3
LigandBDBM50328415
Substrate/Competitorn/a
Meas. Tech.ChEMBL_665527 (CHEMBL1261358)
IC50 18±n/a nM
Citation Chen, CHLee, OYao, CNChuang, MYChang, YLChang, MHWen, YFYang, WHKo, CHChou, NTLin, MWLai, CPSun, CYWang, LMChen, YCHseu, THChang, CNHsu, HCLin, HCChang, YLShih, YCChou, SHHsu, YLTseng, HWLiu, CPTu, CMHu, TLTsai, YJChen, TSLin, CLChiou, SJLiu, CCHwang, CS Novel azulene-based derivatives as potent multi-receptor tyrosine kinase inhibitors. Bioorg Med Chem Lett20:6129-32 (2010) 
 
Receptor-type tyrosine-protein kinase FLT3
Name:Receptor-type tyrosine-protein kinase FLT3
Type:Enzyme
Mol. Mass.:112888.62
Organism:Homo sapiens (Human)
Description:P36888
Residue:993
BDBM50328415
NameBDBM50328415
Synonyms:(Z)-3-((4-(2-(4-(dimethylamino)piperidin-1-yl)ethoxy)-3-methylazulen-1-yl)methylene)-5-fluoroindolin-2-one | CHEMBL1258710
TypeSmall organic molecule
Emp. Form.C29H32FN3O2
Mol. Mass.473.5817
SMILESCN(C)C1CCN(CCOc2ccccc3c(\C=C4/C(=O)Nc5ccc(F)cc45)cc(C)c23)CC1