Reaction Details
TargetMast/stem cell growth factor receptor Kit
LigandBDBM4814
Substrate/Competitorn/a
Meas. Tech.ChEMBL_665524 (CHEMBL679436)
IC50 15±n/a nM
Citation Chen, CHLee, OYao, CNChuang, MYChang, YLChang, MHWen, YFYang, WHKo, CHChou, NTLin, MWLai, CPSun, CYWang, LMChen, YCHseu, THChang, CNHsu, HCLin, HCChang, YLShih, YCChou, SHHsu, YLTseng, HWLiu, CPTu, CMHu, TLTsai, YJChen, TSLin, CLChiou, SJLiu, CCHwang, CS Novel azulene-based derivatives as potent multi-receptor tyrosine kinase inhibitors. Bioorg Med Chem Lett20:6129-32 (2010) 
 
Mast/stem cell growth factor receptor Kit
Name:Mast/stem cell growth factor receptor Kit
Type:Protein
Mol. Mass.:109869.37
Organism:Homo sapiens (Human)
Description:P10721
Residue:976
BDBM4814
NameBDBM4814
Synonyms:CHEMBL535 N-[2-(diethylamino)ethyl]-5-{[(3Z)-5-fluoro-2-oxo-2,3-dihydro-1H-indol-3-ylidene]methyl}-2,4-dimethyl-1H-pyrrole-3-carboxamide SUNITINIB US10464902, Sunitinib US9163010, Sunitinib | US9914707, SU11248
TypeSmall organic molecule
Emp. Form.C22H27FN4O2
Mol. Mass.398.4738
SMILESCCN(CC)CCNC(=O)c1c(C)[nH]c(\C=C2/C(=O)Nc3ccc(F)cc23)c1C