Reaction Details
TargetAurora kinase B
LigandBDBM50328437
Substrate/Competitorn/a
Meas. Tech.ChEMBL_665546 (CHEMBL1261377)
IC50 10540±n/a nM
Citation Bouloc, NLarge, JMKosmopoulou, MSun, CFaisal, AMatteucci, MReynisson, JBrown, NAtrash, BBlagg, JMcDonald, ELinardopoulos, SBayliss, RBavetsias, V Structure-based design of imidazo[1,2-a]pyrazine derivatives as selective inhibitors of Aurora-A kinase in cells. Bioorg Med Chem Lett20:5988-93 (2010) 
 
Aurora kinase B
Name:Aurora kinase B
Type:Protein
Mol. Mass.:39327.72
Organism:Homo sapiens (Human)
Description:Q96GD4
Residue:344
BDBM50328437
NameBDBM50328437
Synonyms:CHEMBL1230687 N-(3-{3-chloro-8-[(4-morpholin-4-ylphenyl)amino]imidazo[1,2-a]pyrazin-6-yl}benzyl)methanesulfonamide
TypeSmall organic molecule
Emp. Form.C24H25ClN6O3S
Mol. Mass.513.012
SMILESCS(=O)(=O)NCc1cccc(c1)-c1cn2c(Cl)cnc2c(Nc2ccc(cc2)N2CCOCC2)n1