Reaction Details
TargetAurora kinase A
LigandBDBM50328425
Substrate/Competitorn/a
Meas. Tech.ChEMBL_665540 (CHEMBL1261371)
IC50 3750±n/a nM
Citation Bouloc, NLarge, JMKosmopoulou, MSun, CFaisal, AMatteucci, MReynisson, JBrown, NAtrash, BBlagg, JMcDonald, ELinardopoulos, SBayliss, RBavetsias, V Structure-based design of imidazo[1,2-a]pyrazine derivatives as selective inhibitors of Aurora-A kinase in cells. Bioorg Med Chem Lett20:5988-93 (2010) 
 
Aurora kinase A
Name:Aurora kinase A
Type:Serine/threonine-protein kinase
Mol. Mass.:45830.98
Organism:Homo sapiens (Human)
Description:O14965
Residue:403
BDBM50328425
NameBDBM50328425
Synonyms:CHEMBL1257445 | N-(4-(6-(pyridin-3-yl)imidazo[1,2-a]pyrazin-8-ylamino)phenyl)benzamide
TypeSmall organic molecule
Emp. Form.C24H18N6O
Mol. Mass.406.4393
SMILESO=C(Nc1ccc(Nc2nc(cn3ccnc23)-c2cccnc2)cc1)c1ccccc1