Reaction Details
TargetAurora kinase A
LigandBDBM50328428
Substrate/Competitorn/a
Meas. Tech.ChEMBL_665540 (CHEMBL1261371)
IC50 7310±n/a nM
Citation Bouloc, NLarge, JMKosmopoulou, MSun, CFaisal, AMatteucci, MReynisson, JBrown, NAtrash, BBlagg, JMcDonald, ELinardopoulos, SBayliss, RBavetsias, V Structure-based design of imidazo[1,2-a]pyrazine derivatives as selective inhibitors of Aurora-A kinase in cells. Bioorg Med Chem Lett20:5988-93 (2010) 
 
Aurora kinase A
Name:Aurora kinase A
Type:Serine/threonine-protein kinase
Mol. Mass.:45830.98
Organism:Homo sapiens (Human)
Description:O14965
Residue:403
BDBM50328428
NameBDBM50328428
Synonyms:2-methoxy-N-(3-(8-(4-methoxyphenylamino)imidazo[1,2-a]pyrazin-6-yl)phenyl)acetamide | CHEMBL1258151
TypeSmall organic molecule
Emp. Form.C22H21N5O3
Mol. Mass.403.4338
SMILESCOCC(=O)Nc1cccc(c1)-c1cn2ccnc2c(Nc2ccc(OC)cc2)n1