Reaction Details
TargetSerine/threonine-protein kinase mTOR
LigandBDBM50328589
Substrate/Competitorn/a
Meas. Tech.ChEMBL_665720 (CHEMBL1261689)
IC50 79±n/a nM
Citation Liu, QChang, JWWang, JKang, SAThoreen, CCMarkhard, AHur, WZhang, JSim, TSabatini, DMGray, NS Discovery of 1-(4-(4-propionylpiperazin-1-yl)-3-(trifluoromethyl)phenyl)-9-(quinolin-3-yl)benzo[h][1,6]naphthyridin-2(1H)-one as a highly potent, selective mammalian target of rapamycin (mTOR) inhibitor for the treatment of cancer. J Med Chem53:7146-55 (2010) 
 
Serine/threonine-protein kinase mTOR
Name:Serine/threonine-protein kinase mTOR
Type:Rapamycin target protein
Mol. Mass.:288917.12
Organism:Homo sapiens (Human)
Description:P42345
Residue:2549
BDBM50328589
NameBDBM50328589
Synonyms:9-(4-methoxyphenyl)-1-(4-(piperazin-1-yl)-3-(trifluoromethyl)phenyl)benzo[h][1,6]naphthyridin-2(1H)-one | CHEMBL1259013
TypeSmall organic molecule
Emp. Form.C30H25F3N4O2
Mol. Mass.530.5403
SMILESCOc1ccc(cc1)-c1ccc2ncc3ccc(=O)n(-c4ccc(N5CCNCC5)c(c4)C(F)(F)F)c3c2c1