Reaction Details
TargetSerine/threonine-protein kinase mTOR
LigandBDBM50328590
Substrate/Competitorn/a
Meas. Tech.ChEMBL_665720 (CHEMBL1261689)
IC50 94±n/a nM
Citation Liu, QChang, JWWang, JKang, SAThoreen, CCMarkhard, AHur, WZhang, JSim, TSabatini, DMGray, NS Discovery of 1-(4-(4-propionylpiperazin-1-yl)-3-(trifluoromethyl)phenyl)-9-(quinolin-3-yl)benzo[h][1,6]naphthyridin-2(1H)-one as a highly potent, selective mammalian target of rapamycin (mTOR) inhibitor for the treatment of cancer. J Med Chem53:7146-55 (2010) 
 
Serine/threonine-protein kinase mTOR
Name:Serine/threonine-protein kinase mTOR
Type:Rapamycin target protein
Mol. Mass.:288917.12
Organism:Homo sapiens (Human)
Description:P42345
Residue:2549
BDBM50328590
NameBDBM50328590
Synonyms:9-(benzo[b]thiophen-3-yl)-1-(4-(piperazin-1-yl)-3-(trifluoromethyl)phenyl)benzo[h][1,6]naphthyridin-2(1H)-one | CHEMBL1259031
TypeSmall organic molecule
Emp. Form.C31H23F3N4OS
Mol. Mass.556.601
SMILESFC(F)(F)c1cc(ccc1N1CCNCC1)-n1c2c(ccc1=O)cnc1ccc(cc21)-c1csc2ccccc12