Reaction Details
TargetSerine/threonine-protein kinase mTOR
LigandBDBM50328605
Substrate/Competitorn/a
Meas. Tech.ChEMBL_665720 (CHEMBL1261689)
IC50 0.570000±n/a nM
Citation Liu, QChang, JWWang, JKang, SAThoreen, CCMarkhard, AHur, WZhang, JSim, TSabatini, DMGray, NS Discovery of 1-(4-(4-propionylpiperazin-1-yl)-3-(trifluoromethyl)phenyl)-9-(quinolin-3-yl)benzo[h][1,6]naphthyridin-2(1H)-one as a highly potent, selective mammalian target of rapamycin (mTOR) inhibitor for the treatment of cancer. J Med Chem53:7146-55 (2010) 
 
Serine/threonine-protein kinase mTOR
Name:Serine/threonine-protein kinase mTOR
Type:Rapamycin target protein
Mol. Mass.:288917.12
Organism:Homo sapiens (Human)
Description:P42345
Residue:2549
BDBM50328605
NameBDBM50328605
Synonyms:1-(4-(4-(2-(4-methylpiperazin-1-yl)acetyl)piperazin-1-yl)-3-(trifluoromethyl)phenyl)-9-(quinolin-3-yl)benzo[h][1,6]naphthyridin-2(1H)-one | CHEMBL1256458
TypeSmall organic molecule
Emp. Form.C39H36F3N7O2
Mol. Mass.691.744
SMILESCN1CCN(CC(=O)N2CCN(CC2)c2ccc(cc2C(F)(F)F)-n2c3c(ccc2=O)cnc2ccc(cc32)-c2cnc3ccccc3c2)CC1