Reaction Details
TargetSerine/threonine-protein kinase mTOR
LigandBDBM50328612
Substrate/Competitorn/a
Meas. Tech.ChEMBL_665720 (CHEMBL1261689)
IC50 230±n/a nM
Citation Liu, QChang, JWWang, JKang, SAThoreen, CCMarkhard, AHur, WZhang, JSim, TSabatini, DMGray, NS Discovery of 1-(4-(4-propionylpiperazin-1-yl)-3-(trifluoromethyl)phenyl)-9-(quinolin-3-yl)benzo[h][1,6]naphthyridin-2(1H)-one as a highly potent, selective mammalian target of rapamycin (mTOR) inhibitor for the treatment of cancer. J Med Chem53:7146-55 (2010) 
 
Serine/threonine-protein kinase mTOR
Name:Serine/threonine-protein kinase mTOR
Type:Rapamycin target protein
Mol. Mass.:288917.12
Organism:Homo sapiens (Human)
Description:P42345
Residue:2549
BDBM50328612
NameBDBM50328612
Synonyms:3-methyl-1-(4-(4-propionylpiperazin-1-yl)-3-(trifluoromethyl)phenyl)-9-(quinolin-3-yl)pyrimido[5,4-c]quinoline-2,4(1H,3H)-dione | CHEMBL1256465
TypeSmall organic molecule
Emp. Form.C35H29F3N6O3
Mol. Mass.638.6384
SMILESCCC(=O)N1CCN(CC1)c1ccc(cc1C(F)(F)F)-n1c2c3cc(ccc3ncc2c(=O)n(C)c1=O)-c1cnc2ccccc2c1