Reaction Details
TargetSerine/threonine-protein kinase mTOR
LigandBDBM50328604
Substrate/Competitorn/a
Meas. Tech.ChEMBL_665716 (CHEMBL1261685)
IC50 50±n/a nM
Citation Liu, QChang, JWWang, JKang, SAThoreen, CCMarkhard, AHur, WZhang, JSim, TSabatini, DMGray, NS Discovery of 1-(4-(4-propionylpiperazin-1-yl)-3-(trifluoromethyl)phenyl)-9-(quinolin-3-yl)benzo[h][1,6]naphthyridin-2(1H)-one as a highly potent, selective mammalian target of rapamycin (mTOR) inhibitor for the treatment of cancer. J Med Chem53:7146-55 (2010) 
 
Serine/threonine-protein kinase mTOR
Name:Serine/threonine-protein kinase mTOR
Type:Enzyme
Mol. Mass.:288814.44
Organism:Mus musculus (Mouse)
Description:Q9JLN9
Residue:2549
BDBM50328604
NameBDBM50328604
Synonyms:1-(4-(4-(3-(dimethylamino)propanoyl)piperazin-1-yl)-3-(trifluoromethyl)phenyl)-9-(quinolin-3-yl)benzo[h][1,6]naphthyridin-2(1H)-one | CHEMBL1256457
TypeSmall organic molecule
Emp. Form.C37H33F3N6O2
Mol. Mass.650.6921
SMILESCN(C)CCC(=O)N1CCN(CC1)c1ccc(cc1C(F)(F)F)-n1c2c(ccc1=O)cnc1ccc(cc21)-c1cnc2ccccc2c1