Reaction Details
TargetBeta-lactamase SHV-1
LigandBDBM50021959
Substrate/Competitorn/a
Meas. Tech.ChEMBL_667618 (CHEMBL1262648)
IC50 170±n/a nM
Citation Mendonça, NManageiro, VRobin, FSalgado, MJFerreira, ECaniça, MBonnet, R The Lys234Arg substitution in the enzyme SHV-72 is a determinant for resistance to clavulanic acid inhibition. Antimicrob Agents Chemother52:1806-11 (2008) 
 
Beta-lactamase SHV-1
Name:Beta-lactamase SHV-1
Type:Protein
Mol. Mass.:31226.68
Organism:Klebsiella pneumoniae (Enterobacteria)
Description:4R3B
Residue:286
BDBM50021959
NameBDBM50021959
Synonyms:CHEMBL777 US9120808, Clavulanic acid potassium salt clavulanic acid
TypeSmall organic molecule
Emp. Form.C8H9NO5
Mol. Mass.199.1608
SMILESOC\C=C1/O[C@@H]2CC(=O)N2[C@H]1C(O)=O