Reaction Details
TargetHistamine H3 receptor
LigandBDBM50159110
Substrate/Competitorn/a
Meas. Tech.ChEMBL_673999 (CHEMBL1275176)
Ki 0.6±n/a nM
Citation Santillan, AMcClure, KJAllison, BDLord, BBoggs, JDMorton, KLEverson, AMNepomuceno, DLetavic, MALee-Dutra, ALovenberg, TWCarruthers, NIGrice, CA Indole- and benzothiophene-based histamine H3 antagonists. Bioorg Med Chem Lett20:6226-30 (2010) 
 
Histamine H3 receptor
Name:Histamine H3 receptor
Type:G Protein-Coupled Receptor (GPCR)
Mol. Mass.:48691.47
Organism:Homo sapiens (Human)
Description:Binding assays were using CHO cells stably expressing hH3R receptors.
Residue:445
BDBM50159110
NameBDBM50159110
Synonyms:1-(3-(4-(piperidin-1-ylmethyl)phenoxy)propyl)piperidine 1-[3-(4-hexahydro-1-pyridinylmethylphenoxy)propyl]hexahydropyridine CHEMBL129542 | JNJ-5207852
TypeSmall organic molecule
Emp. Form.C20H32N2O
Mol. Mass.316.4809
SMILESC(COc1ccc(CN2CCCCC2)cc1)CN1CCCCC1