Reaction Details
TargetCannabinoid receptor 1
LigandBDBM50328962
Substrate/Competitorn/a
Meas. Tech.ChEMBL_674011 (CHEMBL1275188)
EC50 3037±n/a nM
Citation Zhang, YGilliam, AMaitra, RDamaj, MITajuba, JMSeltzman, HHThomas, BF Synthesis and biological evaluation of bivalent ligands for the cannabinoid 1 receptor. J Med Chem53:7048-60 (2010) 
 
Cannabinoid receptor 1
Name:Cannabinoid receptor 1
Type:G Protein-Coupled Receptor (GPCR)
Mol. Mass.:52856.55
Organism:Rattus norvegicus (rat)
Description:P20272
Residue:473
BDBM50328962
NameBDBM50328962
Synonyms:CHEMBL1270563 | N-{5-[(5-Aminopentyl)(methyl)amino]pentyl}-5-(4-chlorophenyl)-1-(2,4-dichlorophenyl)-4-methyl-1H-pyrazole-3-carboxamide
TypeSmall organic molecule
Emp. Form.C28H36Cl3N5O
Mol. Mass.564.977
SMILESCN(CCCCCN)CCCCCNC(=O)c1nn(c(c1C)-c1ccc(Cl)cc1)-c1ccc(Cl)cc1Cl