Reaction Details
TargetCannabinoid receptor 1
LigandBDBM50328961
Substrate/Competitorn/a
Meas. Tech.ChEMBL_674007 (CHEMBL1275184)
Ki 37.5±n/a nM
Citation Zhang, YGilliam, AMaitra, RDamaj, MITajuba, JMSeltzman, HHThomas, BF Synthesis and biological evaluation of bivalent ligands for the cannabinoid 1 receptor. J Med Chem53:7048-60 (2010) 
 
Cannabinoid receptor 1
Name:Cannabinoid receptor 1
Type:G Protein-Coupled Receptor (GPCR)
Mol. Mass.:52868.96
Organism:Homo sapiens (Human)
Description:P21554
Residue:472
BDBM50328961
NameBDBM50328961
Synonyms:CHEMBL1270662 | N-{7-[(7-Aminoheptyl)(methyl)amino]heptyl}-5-(4-chlorophenyl)-1-(2,4-dichlorophenyl)-4-methyl-1H-pyrazole-3-carboxamide
TypeSmall organic molecule
Emp. Form.C32H44Cl3N5O
Mol. Mass.621.084
SMILESCN(CCCCCCCN)CCCCCCCNC(=O)c1nn(c(c1C)-c1ccc(Cl)cc1)-c1ccc(Cl)cc1Cl