Reaction Details
TargetCannabinoid receptor 1
LigandBDBM50328950
Substrate/Competitorn/a
Meas. Tech.ChEMBL_674011 (CHEMBL1275188)
EC50>10000±n/a nM
Citation Zhang, YGilliam, AMaitra, RDamaj, MITajuba, JMSeltzman, HHThomas, BF Synthesis and biological evaluation of bivalent ligands for the cannabinoid 1 receptor. J Med Chem53:7048-60 (2010) 
 
Cannabinoid receptor 1
Name:Cannabinoid receptor 1
Type:G Protein-Coupled Receptor (GPCR)
Mol. Mass.:52856.55
Organism:Rattus norvegicus (rat)
Description:P20272
Residue:473
BDBM50328950
NameBDBM50328950
Synonyms:CHEMBL1269768 | N,N'-(Iminodiundecane-11,1-diyl)bis[5-(4-chlorophenyl)-1-(2,4-dichlorophenyl)-4-methyl-1H-pyrazole-3-carboxamide]
TypeSmall organic molecule
Emp. Form.C56H67Cl6N7O2
Mol. Mass.1082.895
SMILESCc1c(nn(c1-c1ccc(Cl)cc1)-c1ccc(Cl)cc1Cl)C(=O)NCCCCCCCCCCCNCCCCCCCCCCCNC(=O)c1nn(c(c1C)-c1ccc(Cl)cc1)-c1ccc(Cl)cc1Cl