Reaction Details
TargetCannabinoid receptor 2
LigandBDBM50328959
Substrate/Competitorn/a
Meas. Tech.ChEMBL_674009 (CHEMBL1275186)
Ki>2500±n/a nM
Citation Zhang, YGilliam, AMaitra, RDamaj, MITajuba, JMSeltzman, HHThomas, BF Synthesis and biological evaluation of bivalent ligands for the cannabinoid 1 receptor. J Med Chem53:7048-60 (2010) 
 
Cannabinoid receptor 2
Name:Cannabinoid receptor 2
Type:G Protein-Coupled Receptor (GPCR)
Mol. Mass.:39690.94
Organism:Homo sapiens (Human)
Description:P34972
Residue:360
BDBM50328959
NameBDBM50328959
Synonyms:CHEMBL1270369 | N-{5-[(5-Aminopentyl)amino]pentyl}-5-(4-chlorophenyl)-1-(2,4-dichlorophenyl)-4-methyl-1H-pyrazole-3-carboxamide
TypeSmall organic molecule
Emp. Form.C27H34Cl3N5O
Mol. Mass.550.951
SMILESCc1c(nn(c1-c1ccc(Cl)cc1)-c1ccc(Cl)cc1Cl)C(=O)NCCCCCNCCCCCN