Reaction Details
TargetCannabinoid receptor 1
LigandBDBM50328966
Substrate/Competitorn/a
Meas. Tech.ChEMBL_674013 (CHEMBL1275190)
EC50 59.8±n/a nM
Citation Zhang, YGilliam, AMaitra, RDamaj, MITajuba, JMSeltzman, HHThomas, BF Synthesis and biological evaluation of bivalent ligands for the cannabinoid 1 receptor. J Med Chem53:7048-60 (2010) 
 
Cannabinoid receptor 1
Name:Cannabinoid receptor 1
Type:G Protein-Coupled Receptor (GPCR)
Mol. Mass.:52868.96
Organism:Homo sapiens (Human)
Description:P21554
Residue:472
BDBM50328966
NameBDBM50328966
Synonyms:CHEMBL1269769 | N,N'-[(Methylimino)dipentane-5,1-diyl]bis[5-(4-chlorophenyl)-1-(2,4-dichlorophenyl)-4-methyl-1H-pyrazole-3-carboxamide]
TypeSmall organic molecule
Emp. Form.C45H45Cl6N7O2
Mol. Mass.928.603
SMILESCN(CCCCCNC(=O)c1nn(c(c1C)-c1ccc(Cl)cc1)-c1ccc(Cl)cc1Cl)CCCCCNC(=O)c1nn(c(c1C)-c1ccc(Cl)cc1)-c1ccc(Cl)cc1Cl