Reaction Details
TargetRenin
LigandBDBM50329029
Substrate/Competitorn/a
Meas. Tech.ChEMBL_674153 (CHEMBL1274250)
IC50 24±n/a nM
Citation Scheiper, BMatter, HSteinhagen, HStilz, UBöcskei, ZFleury, VMcCort, G Discovery and optimization of a new class of potent and non-chiral indole-3-carboxamide-based renin inhibitors. Bioorg Med Chem Lett20:6268-72 (2010) 
 
Renin
Name:Renin
Type:Enzyme
Mol. Mass.:45058.99
Organism:Homo sapiens (Human)
Description:n/a
Residue:406
BDBM50329029
NameBDBM50329029
Synonyms:(2-(5-fluoro-2-methylphenoxy)-6-methoxy-1-phenyl-1H-indol-3-yl)(piperazin-1-yl)methanone | CHEMBL1271392
TypeSmall organic molecule
Emp. Form.C27H26FN3O3
Mol. Mass.459.512
SMILESCOc1ccc2c(C(=O)N3CCNCC3)c(Oc3cc(F)ccc3C)n(-c3ccccc3)c2c1