Reaction Details
TargetRenin
LigandBDBM50329048
Substrate/Competitorn/a
Meas. Tech.ChEMBL_674153 (CHEMBL1274250)
IC50 18±n/a nM
Citation Scheiper, BMatter, HSteinhagen, HStilz, UBöcskei, ZFleury, VMcCort, G Discovery and optimization of a new class of potent and non-chiral indole-3-carboxamide-based renin inhibitors. Bioorg Med Chem Lett20:6268-72 (2010) 
 
Renin
Name:Renin
Type:Enzyme
Mol. Mass.:45058.99
Organism:Homo sapiens (Human)
Description:n/a
Residue:406
BDBM50329048
NameBDBM50329048
Synonyms:(2-(2-chloro-6-fluorobenzyl)-1-phenyl-1H-indol-3-yl)(piperazin-1-yl)methanone | CHEMBL1270668
TypeSmall organic molecule
Emp. Form.C26H23ClFN3O
Mol. Mass.447.932
SMILESFc1cccc(Cl)c1Cc1c(C(=O)N2CCNCC2)c2ccccc2n1-c1ccccc1