Reaction Details
TargetCannabinoid receptor 2
LigandBDBM50329128
Substrate/Competitorn/a
Meas. Tech.ChEMBL_674397 (CHEMBL1274726)
Ki 1.6±n/a nM
Citation Tong, LShankar, BBChen, LRizvi, RKelly, JGilbert, EHuang, CYang, DYKozlowski, JAShih, NYGonsiorek, WHipkin, RWMalikzay, ALunn, CALundell, DJ Expansion of SAR studies on triaryl bis sulfone cannabinoid CB2 receptor ligands. Bioorg Med Chem Lett20:6785-9 (2010) 
 
Cannabinoid receptor 2
Name:Cannabinoid receptor 2
Type:G Protein-Coupled Receptor (GPCR)
Mol. Mass.:39690.94
Organism:Homo sapiens (Human)
Description:P34972
Residue:360
BDBM50329128
NameBDBM50329128
Synonyms:1,1,1-trifluoro-N-((4-propyl-1-(1-(pyridin-2-ylsulfonyl)-1H-indol-2-ylsulfonyl)piperidin-4-yl)methyl)methanesulfonamide | CHEMBL1271194
TypeSmall organic molecule
Emp. Form.C23H27F3N4O6S3
Mol. Mass.608.674
SMILESCCCC1(CNS(=O)(=O)C(F)(F)F)CCN(CC1)S(=O)(=O)c1cc2ccccc2n1S(=O)(=O)c1ccccn1