Reaction Details
TargetCannabinoid receptor 2
LigandBDBM50329145
Substrate/Competitorn/a
Meas. Tech.ChEMBL_674397 (CHEMBL1274726)
Ki 78±n/a nM
Citation Tong, LShankar, BBChen, LRizvi, RKelly, JGilbert, EHuang, CYang, DYKozlowski, JAShih, NYGonsiorek, WHipkin, RWMalikzay, ALunn, CALundell, DJ Expansion of SAR studies on triaryl bis sulfone cannabinoid CB2 receptor ligands. Bioorg Med Chem Lett20:6785-9 (2010) 
 
Cannabinoid receptor 2
Name:Cannabinoid receptor 2
Type:G Protein-Coupled Receptor (GPCR)
Mol. Mass.:39690.94
Organism:Homo sapiens (Human)
Description:P34972
Residue:360
BDBM50329145
NameBDBM50329145
Synonyms:1,1,1-trifluoro-N-((1-(1-(2-fluorophenylsulfonyl)-1H-indol-2-ylsulfonyl)-3-isopropylpiperidin-3-yl)methyl)methanesulfonamide | CHEMBL1271400
TypeSmall organic molecule
Emp. Form.C24H27F4N3O6S3
Mol. Mass.625.676
SMILESCC(C)C1(CNS(=O)(=O)C(F)(F)F)CCCN(C1)S(=O)(=O)c1cc2ccccc2n1S(=O)(=O)c1ccccc1F