Reaction Details
TargetSubstance-P receptor
LigandBDBM50329162
Substrate/Competitorn/a
Meas. Tech.ChEMBL_674420 (CHEMBL1274749)
Ki 1.1±n/a nM
Citation Ratni, HBallard, TMBissantz, CHoffmann, TJablonski, PKnoflach, FKnust, HMalherbe, PNettekoven, MPatiny-Adam, ARiemer, CSchmitt, MSpooren, W Rational design of novel pyrrolidine derivatives as orally active neurokinin-3 receptor antagonists. Bioorg Med Chem Lett20:6735-8 (2010) 
 
Substance-P receptor
Name:Substance-P receptor
Type:G Protein-Coupled Receptor (GPCR)
Mol. Mass.:46254.43
Organism:Homo sapiens (Human)
Description:P25103
Residue:407
BDBM50329162
NameBDBM50329162
Synonyms:(3R,4S)-3-(2-(3,5-bis(trifluoromethyl)phenyl)-N,2-dimethylpropanamido)-4-(4-fluorophenyl)-N,N-bis(2-hydroxyethyl)pyrrolidine-1-carboxamide | CHEMBL1269638
TypeSmall organic molecule
Emp. Form.C28H32F7N3O4
Mol. Mass.607.5602
SMILESCN([C@H]1CN(C[C@@H]1c1ccc(F)cc1)C(=O)N(CCO)CCO)C(=O)C(C)(C)c1cc(cc(c1)C(F)(F)F)C(F)(F)F