Reaction Details
Target11-beta-hydroxysteroid dehydrogenase type 2
LigandBDBM50233538
Substrate/Competitorn/a
Meas. Tech.ChEMBL_674863 (CHEMBL1272436)
IC50 257±n/a nM
Citation Stanetty, CCzollner, LKoller, IShah, PGaware, RCunha, TDOdermatt, AJordis, UKosma, PClassen-Houben, D Synthesis of novel 3-amino and 29-hydroxamic acid derivatives of glycyrrhetinic acid as selective 11ß-hydroxysteroid dehydrogenase 2 inhibitors. Bioorg Med Chem18:7522-41 (2010) 
 
11-beta-hydroxysteroid dehydrogenase type 2
Name:11-beta-hydroxysteroid dehydrogenase type 2
Type:Enzyme
Mol. Mass.:44141.72
Organism:Homo sapiens (Human)
Description:Purified recombinant human 11beta-HSD2.
Residue:405
BDBM50233538
NameBDBM50233538
Synonyms:18beta-glycyrrhetic acid CHEMBL230006 glycyrrhetinic acid
TypeSmall organic molecule
Emp. Form.C30H46O4
Mol. Mass.470.6838
SMILESCC1(C)[C@@H](O)CC[C@@]2(C)[C@H]1CC[C@]1(C)[C@@H]2C(=O)C=C2[C@@H]3C[C@](C)(CC[C@]3(C)CC[C@@]12C)C(O)=O