Reaction Details
TargetLethal factor
LigandBDBM50329258
Substrate/Competitorn/a
Meas. Tech.ChEMBL_675361 (CHEMBL1273398)
Ki 7.3±n/a nM
Citation Jiao, GSKim, SMoayeri, MCregar-Hernandez, LMcKasson, LMargosiak, SALeppla, SHJohnson, AT Antidotes to anthrax lethal factor intoxication. Part 1: Discovery of potent lethal factor inhibitors with in vivo efficacy. Bioorg Med Chem Lett20:6850-3 (2010) 
 
Lethal factor
Name:Lethal factor
Type:PROTEIN
Mol. Mass.:93758.56
Organism:Bacillus anthracis
Description:ChEMBL_1460338
Residue:809
BDBM50329258
NameBDBM50329258
Synonyms:(R)-4-fluoro-N-(5-(4-fluoro-3,5-dimethylphenylamino)-6-(hydroxyamino)-6-oxohexyl)-3-methylbenzamide | CHEMBL1271312
TypeSmall organic molecule
Emp. Form.C22H27F2N3O3
Mol. Mass.419.4649
SMILESCc1cc(ccc1F)C(=O)NCCCC[C@@H](Nc1cc(C)c(F)c(C)c1)C(=O)NO