Reaction Details
TargetLethal factor
LigandBDBM50329259
Substrate/Competitorn/a
Meas. Tech.ChEMBL_675361 (CHEMBL1273398)
Ki 8.2±n/a nM
Citation Jiao, GSKim, SMoayeri, MCregar-Hernandez, LMcKasson, LMargosiak, SALeppla, SHJohnson, AT Antidotes to anthrax lethal factor intoxication. Part 1: Discovery of potent lethal factor inhibitors with in vivo efficacy. Bioorg Med Chem Lett20:6850-3 (2010) 
 
Lethal factor
Name:Lethal factor
Type:PROTEIN
Mol. Mass.:93758.56
Organism:Bacillus anthracis
Description:ChEMBL_1460338
Residue:809
BDBM50329259
NameBDBM50329259
Synonyms:(R)-6-amino-2-(4-fluoro-3,5-dimethylphenylamino)-N-hydroxyhexanamide | CHEMBL1269054
TypeSmall organic molecule
Emp. Form.C14H22FN3O2
Mol. Mass.283.3418
SMILESCc1cc(N[C@H](CCCCN)C(=O)NO)cc(C)c1F