Reaction Details
TargetLethal factor
LigandBDBM50329260
Substrate/Competitorn/a
Meas. Tech.ChEMBL_675361 (CHEMBL1273398)
Ki 3.1±n/a nM
Citation Jiao, GSKim, SMoayeri, MCregar-Hernandez, LMcKasson, LMargosiak, SALeppla, SHJohnson, AT Antidotes to anthrax lethal factor intoxication. Part 1: Discovery of potent lethal factor inhibitors with in vivo efficacy. Bioorg Med Chem Lett20:6850-3 (2010) 
 
Lethal factor
Name:Lethal factor
Type:PROTEIN
Mol. Mass.:93758.56
Organism:Bacillus anthracis
Description:ChEMBL_1460338
Residue:809
BDBM50329260
NameBDBM50329260
Synonyms:(R)-2-(4-fluoro-3,5-dimethylphenylamino)-6-(4-fluoro-3-methylphenylsulfonamido)-N-hydroxyhexanamide | CHEMBL1271419
TypeSmall organic molecule
Emp. Form.C21H27F2N3O4S
Mol. Mass.455.519
SMILESCc1cc(ccc1F)S(=O)(=O)NCCCC[C@@H](Nc1cc(C)c(F)c(C)c1)C(=O)NO