Reaction Details
TargetLethal factor
LigandBDBM50329261
Substrate/Competitorn/a
Meas. Tech.ChEMBL_675361 (CHEMBL1273398)
Ki 0.05±n/a nM
Citation Jiao, GSKim, SMoayeri, MCregar-Hernandez, LMcKasson, LMargosiak, SALeppla, SHJohnson, AT Antidotes to anthrax lethal factor intoxication. Part 1: Discovery of potent lethal factor inhibitors with in vivo efficacy. Bioorg Med Chem Lett20:6850-3 (2010) 
 
Lethal factor
Name:Lethal factor
Type:PROTEIN
Mol. Mass.:93758.56
Organism:Bacillus anthracis
Description:ChEMBL_1460338
Residue:809
BDBM50329261
NameBDBM50329261
Synonyms:(R)-2-(4-fluoro-3,5-dimethylphenylamino)-6-(4-fluoro-3-methylbenzylamino)-N-hydroxyhexanamide | CHEMBL1271420
TypeSmall organic molecule
Emp. Form.C22H29F2N3O2
Mol. Mass.405.4814
SMILESCc1cc(CNCCCC[C@@H](Nc2cc(C)c(F)c(C)c2)C(=O)NO)ccc1F