Reaction Details
TargetLethal factor
LigandBDBM50329262
Substrate/Competitorn/a
Meas. Tech.ChEMBL_675361 (CHEMBL1273398)
Ki 9.3±n/a nM
Citation Jiao, GSKim, SMoayeri, MCregar-Hernandez, LMcKasson, LMargosiak, SALeppla, SHJohnson, AT Antidotes to anthrax lethal factor intoxication. Part 1: Discovery of potent lethal factor inhibitors with in vivo efficacy. Bioorg Med Chem Lett20:6850-3 (2010) 
 
Lethal factor
Name:Lethal factor
Type:PROTEIN
Mol. Mass.:93758.56
Organism:Bacillus anthracis
Description:ChEMBL_1460338
Residue:809
BDBM50329262
NameBDBM50329262
Synonyms:(R)-2-(4-fluoro-3,5-dimethylphenylamino)-6-(3-(4-fluoro-3-methylphenyl)ureido)-N-hydroxyhexanamide | CHEMBL1269886
TypeSmall organic molecule
Emp. Form.C22H28F2N4O3
Mol. Mass.434.4795
SMILESCc1cc(NC(=O)NCCCC[C@@H](Nc2cc(C)c(F)c(C)c2)C(=O)NO)ccc1F