Reaction Details
TargetLethal factor
LigandBDBM50329264
Substrate/Competitorn/a
Meas. Tech.ChEMBL_675361 (CHEMBL1273398)
Ki 0.85±n/a nM
Citation Jiao, GSKim, SMoayeri, MCregar-Hernandez, LMcKasson, LMargosiak, SALeppla, SHJohnson, AT Antidotes to anthrax lethal factor intoxication. Part 1: Discovery of potent lethal factor inhibitors with in vivo efficacy. Bioorg Med Chem Lett20:6850-3 (2010) 
 
Lethal factor
Name:Lethal factor
Type:PROTEIN
Mol. Mass.:93758.56
Organism:Bacillus anthracis
Description:ChEMBL_1460338
Residue:809
BDBM50329264
NameBDBM50329264
Synonyms:(R)-2-(4-fluoro-3,5-dimethylphenylamino)-6-(3-fluorobenzylamino)-N-hydroxyhexanamide | CHEMBL1269993
TypeSmall organic molecule
Emp. Form.C21H27F2N3O2
Mol. Mass.391.4548
SMILESCc1cc(N[C@H](CCCCNCc2cccc(F)c2)C(=O)NO)cc(C)c1F