Reaction Details
TargetLethal factor
LigandBDBM50329274
Substrate/Competitorn/a
Meas. Tech.ChEMBL_675361 (CHEMBL1273398)
Ki 96±n/a nM
Citation Jiao, GSKim, SMoayeri, MCregar-Hernandez, LMcKasson, LMargosiak, SALeppla, SHJohnson, AT Antidotes to anthrax lethal factor intoxication. Part 1: Discovery of potent lethal factor inhibitors with in vivo efficacy. Bioorg Med Chem Lett20:6850-3 (2010) 
 
Lethal factor
Name:Lethal factor
Type:PROTEIN
Mol. Mass.:93758.56
Organism:Bacillus anthracis
Description:ChEMBL_1460338
Residue:809
BDBM50329274
NameBDBM50329274
Synonyms:(2S,4R)-2-(2-(dimethylamino)ethyl)-4-(4-fluorophenyl)-N-hydroxy-4-methoxybutanamide | CHEMBL1270496
TypeSmall organic molecule
Emp. Form.C15H23FN2O3
Mol. Mass.298.3531
SMILESCO[C@H](C[C@H](CCN(C)C)C(=O)NO)c1ccc(F)cc1