Reaction Details
TargetLethal factor
LigandBDBM50329278
Substrate/Competitorn/a
Meas. Tech.ChEMBL_675361 (CHEMBL1273398)
Ki 99±n/a nM
Citation Jiao, GSKim, SMoayeri, MCregar-Hernandez, LMcKasson, LMargosiak, SALeppla, SHJohnson, AT Antidotes to anthrax lethal factor intoxication. Part 1: Discovery of potent lethal factor inhibitors with in vivo efficacy. Bioorg Med Chem Lett20:6850-3 (2010) 
 
Lethal factor
Name:Lethal factor
Type:PROTEIN
Mol. Mass.:93758.56
Organism:Bacillus anthracis
Description:ChEMBL_1460338
Residue:809
BDBM50329278
NameBDBM50329278
Synonyms:(2S,4R)-4-(4-fluorophenyl)-N-hydroxy-2-(2-(3-(hydroxymethyl)piperidin-1-yl)ethyl)-4-methoxybutanamide | CHEMBL1270599
TypeSmall organic molecule
Emp. Form.C19H29FN2O4
Mol. Mass.368.443
SMILESCO[C@H](C[C@H](CCN1CCCC(CO)C1)C(=O)NO)c1ccc(F)cc1