Reaction Details
TargetLethal factor
LigandBDBM50329279
Substrate/Competitorn/a
Meas. Tech.ChEMBL_675361 (CHEMBL1273398)
Ki 33±n/a nM
Citation Jiao, GSKim, SMoayeri, MCregar-Hernandez, LMcKasson, LMargosiak, SALeppla, SHJohnson, AT Antidotes to anthrax lethal factor intoxication. Part 1: Discovery of potent lethal factor inhibitors with in vivo efficacy. Bioorg Med Chem Lett20:6850-3 (2010) 
 
Lethal factor
Name:Lethal factor
Type:PROTEIN
Mol. Mass.:93758.56
Organism:Bacillus anthracis
Description:ChEMBL_1460338
Residue:809
BDBM50329279
NameBDBM50329279
Synonyms:(2S,4R)-2-(2-(3-(4-fluorobenzyl)piperidin-1-yl)ethyl)-4-(4-fluorophenyl)-N-hydroxy-4-methoxybutanamide | CHEMBL1270697
TypeSmall organic molecule
Emp. Form.C25H32F2N2O3
Mol. Mass.446.53
SMILESCO[C@H](C[C@H](CCN1CCCC(Cc2ccc(F)cc2)C1)C(=O)NO)c1ccc(F)cc1