Reaction Details
TargetLethal factor
LigandBDBM50329280
Substrate/Competitorn/a
Meas. Tech.ChEMBL_675361 (CHEMBL1273398)
Ki 90±n/a nM
Citation Jiao, GSKim, SMoayeri, MCregar-Hernandez, LMcKasson, LMargosiak, SALeppla, SHJohnson, AT Antidotes to anthrax lethal factor intoxication. Part 1: Discovery of potent lethal factor inhibitors with in vivo efficacy. Bioorg Med Chem Lett20:6850-3 (2010) 
 
Lethal factor
Name:Lethal factor
Type:PROTEIN
Mol. Mass.:93758.56
Organism:Bacillus anthracis
Description:ChEMBL_1460338
Residue:809
BDBM50329280
NameBDBM50329280
Synonyms:(2S,4R)-4-(4-fluorophenyl)-N-hydroxy-4-methoxy-2-(2-(piperazin-1-yl)ethyl)butanamide | CHEMBL1270698
TypeSmall organic molecule
Emp. Form.C17H26FN3O3
Mol. Mass.339.405
SMILESCO[C@H](C[C@H](CCN1CCNCC1)C(=O)NO)c1ccc(F)cc1