Reaction Details
TargetLethal factor
LigandBDBM50329282
Substrate/Competitorn/a
Meas. Tech.ChEMBL_675361 (CHEMBL1273398)
Ki 115±n/a nM
Citation Jiao, GSKim, SMoayeri, MCregar-Hernandez, LMcKasson, LMargosiak, SALeppla, SHJohnson, AT Antidotes to anthrax lethal factor intoxication. Part 1: Discovery of potent lethal factor inhibitors with in vivo efficacy. Bioorg Med Chem Lett20:6850-3 (2010) 
 
Lethal factor
Name:Lethal factor
Type:PROTEIN
Mol. Mass.:93758.56
Organism:Bacillus anthracis
Description:ChEMBL_1460338
Residue:809
BDBM50329282
NameBDBM50329282
Synonyms:(2S,4R)-2-(2-(4-benzylpiperazin-1-yl)ethyl)-4-(4-fluorophenyl)-N-hydroxy-4-methoxybutanamide | CHEMBL1270802
TypeSmall organic molecule
Emp. Form.C24H32FN3O3
Mol. Mass.429.5276
SMILESCO[C@H](C[C@H](CCN1CCN(Cc2ccccc2)CC1)C(=O)NO)c1ccc(F)cc1