Reaction Details
TargetLethal factor
LigandBDBM50329285
Substrate/Competitorn/a
Meas. Tech.ChEMBL_675361 (CHEMBL1273398)
Ki 11±n/a nM
Citation Jiao, GSKim, SMoayeri, MCregar-Hernandez, LMcKasson, LMargosiak, SALeppla, SHJohnson, AT Antidotes to anthrax lethal factor intoxication. Part 1: Discovery of potent lethal factor inhibitors with in vivo efficacy. Bioorg Med Chem Lett20:6850-3 (2010) 
 
Lethal factor
Name:Lethal factor
Type:PROTEIN
Mol. Mass.:93758.56
Organism:Bacillus anthracis
Description:ChEMBL_1460338
Residue:809
BDBM50329285
NameBDBM50329285
Synonyms:(2S,4R)-2-(2-((3-(4-fluoro-3-methylphenyl)propyl)(methyl)amino)ethyl)-4-(4-fluorophenyl)-N-hydroxy-4-methoxybutanamide | CHEMBL1271003
TypeSmall organic molecule
Emp. Form.C24H32F2N2O3
Mol. Mass.434.5193
SMILESCO[C@H](C[C@H](CCN(C)CCCc1ccc(F)c(C)c1)C(=O)NO)c1ccc(F)cc1