Reaction Details
TargetLethal factor
LigandBDBM50329286
Substrate/Competitorn/a
Meas. Tech.ChEMBL_675361 (CHEMBL1273398)
Ki 135±n/a nM
Citation Jiao, GSKim, SMoayeri, MCregar-Hernandez, LMcKasson, LMargosiak, SALeppla, SHJohnson, AT Antidotes to anthrax lethal factor intoxication. Part 1: Discovery of potent lethal factor inhibitors with in vivo efficacy. Bioorg Med Chem Lett20:6850-3 (2010) 
 
Lethal factor
Name:Lethal factor
Type:PROTEIN
Mol. Mass.:93758.56
Organism:Bacillus anthracis
Description:ChEMBL_1460338
Residue:809
BDBM50329286
NameBDBM50329286
Synonyms:(2S,4R)-2-(2-(((4'-fluoro-3'-methylbiphenyl-4-yl)methyl)(methyl)amino)ethyl)-4-(4-fluorophenyl)-N-hydroxy-4-methoxybutanamide | CHEMBL1271004
TypeSmall organic molecule
Emp. Form.C28H32F2N2O3
Mol. Mass.482.5621
SMILESCO[C@H](C[C@H](CCN(C)Cc1ccc(cc1)-c1ccc(F)c(C)c1)C(=O)NO)c1ccc(F)cc1