Reaction Details
TargetAdenosine receptor A2a
LigandBDBM50329339
Substrate/Competitorn/a
Meas. Tech.ChEMBL_675428 (CHEMBL1273565)
Ki 48±n/a nM
Citation McGuinness, BFCole, AGDong, GBrescia, MRShao, YHenderson, IRokosz, LLStauffer, TMMannava, NKimble, EFHicks, CWhite, NWines, PGQuadros, E Discovery of 2-aminoimidazopyridine adenosine A(2A) receptor antagonists. Bioorg Med Chem Lett20:6845-9 (2010) 
 
Adenosine receptor A2a
Name:Adenosine receptor A2a
Type:G Protein-Coupled Receptor (GPCR)
Mol. Mass.:44716.46
Organism:Homo sapiens (Human)
Description:P29274
Residue:412
BDBM50329339
NameBDBM50329339
Synonyms:CHEMBL1270316 | N-butyl-2-(3-cyanobenzamido)-1-(3-methoxypropyl)-1H-benzo[d]imidazole-5-carboxamide
TypeSmall organic molecule
Emp. Form.C24H27N5O3
Mol. Mass.433.5029
SMILESCCCCNC(=O)c1ccc2n(CCCOC)c(NC(=O)c3cccc(c3)C#N)nc2c1