Reaction Details
TargetAdenosine receptor A2a
LigandBDBM50329340
Substrate/Competitorn/a
Meas. Tech.ChEMBL_675428 (CHEMBL1273565)
Ki 40±n/a nM
Citation McGuinness, BFCole, AGDong, GBrescia, MRShao, YHenderson, IRokosz, LLStauffer, TMMannava, NKimble, EFHicks, CWhite, NWines, PGQuadros, E Discovery of 2-aminoimidazopyridine adenosine A(2A) receptor antagonists. Bioorg Med Chem Lett20:6845-9 (2010) 
 
Adenosine receptor A2a
Name:Adenosine receptor A2a
Type:G Protein-Coupled Receptor (GPCR)
Mol. Mass.:44716.46
Organism:Homo sapiens (Human)
Description:P29274
Residue:412
BDBM50329340
NameBDBM50329340
Synonyms:CHEMBL1270414 | N-butyl-2-(3-cyanobenzamido)-3-(3-methoxypropyl)-3H-imidazo[4,5-b]pyridine-6-carboxamide
TypeSmall organic molecule
Emp. Form.C23H26N6O3
Mol. Mass.434.4909
SMILESCCCCNC(=O)c1cnc2n(CCCOC)c(NC(=O)c3cccc(c3)C#N)nc2c1