Reaction Details
TargetAdenosine receptor A2a
LigandBDBM50329349
Substrate/Competitorn/a
Meas. Tech.ChEMBL_675428 (CHEMBL1273565)
Ki 11±n/a nM
Citation McGuinness, BFCole, AGDong, GBrescia, MRShao, YHenderson, IRokosz, LLStauffer, TMMannava, NKimble, EFHicks, CWhite, NWines, PGQuadros, E Discovery of 2-aminoimidazopyridine adenosine A(2A) receptor antagonists. Bioorg Med Chem Lett20:6845-9 (2010) 
 
Adenosine receptor A2a
Name:Adenosine receptor A2a
Type:G Protein-Coupled Receptor (GPCR)
Mol. Mass.:44716.46
Organism:Homo sapiens (Human)
Description:P29274
Residue:412
BDBM50329349
NameBDBM50329349
Synonyms:(S)-3-cyano-N-(3-(3-methoxypropyl)-6-(2-methylpiperidine-1-carbonyl)-3H-imidazo[4,5-b]pyridin-2-yl)benzamide | CHEMBL1270814
TypeSmall organic molecule
Emp. Form.C25H28N6O3
Mol. Mass.460.5282
SMILESCOCCCn1c(NC(=O)c2cccc(c2)C#N)nc2cc(cnc12)C(=O)N1CCCC[C@@H]1C