Reaction Details
TargetBeta-secretase 1
LigandBDBM50329533
Substrate/Competitorn/a
Meas. Tech.ChEMBL_674717 (CHEMBL1273970)
IC50 30±n/a nM
Citation Malamas, MSRobichaud, AErdei, JQuagliato, DSolvibile, WZhou, PMorris, KTurner, JWagner, EFan, KOlland, AJacobsen, SReinhart, PRiddell, DPangalos, M Design and synthesis of aminohydantoins as potent and selective humanß-secretase (BACE1) inhibitors with enhanced brain permeability. Bioorg Med Chem Lett20:6597-605 (2010) 
 
Beta-secretase 1
Name:Beta-secretase 1
Type:Protein
Mol. Mass.:55755.10
Organism:Homo sapiens (Human)
Description:P56817
Residue:501
BDBM50329533
NameBDBM50329533
Synonyms:(R,E)-2-amino-4-(3-(4,4-difluorobut-1-enyl)phenyl)-4-(4-(difluoromethoxy)phenyl)-1-methyl-1H-imidazol-5(4H)-one | CHEMBL1270433
TypeSmall organic molecule
Emp. Form.C21H19F4N3O2
Mol. Mass.421.3881
SMILESCN1C(N)=N[C@](C1=O)(c1ccc(OC(F)F)cc1)c1cccc(\C=C\CC(F)F)c1