Reaction Details
TargetBeta-secretase 1
LigandBDBM50329567
Substrate/Competitorn/a
Meas. Tech.ChEMBL_674717 (CHEMBL1273970)
IC50 30±n/a nM
Citation Malamas, MSRobichaud, AErdei, JQuagliato, DSolvibile, WZhou, PMorris, KTurner, JWagner, EFan, KOlland, AJacobsen, SReinhart, PRiddell, DPangalos, M Design and synthesis of aminohydantoins as potent and selective humanß-secretase (BACE1) inhibitors with enhanced brain permeability. Bioorg Med Chem Lett20:6597-605 (2010) 
 
Beta-secretase 1
Name:Beta-secretase 1
Type:Protein
Mol. Mass.:55755.10
Organism:Homo sapiens (Human)
Description:P56817
Residue:501
BDBM50329567
NameBDBM50329567
Synonyms:(R)-2-amino-4-(3-(4,4-difluorobut-3-enyloxy)phenyl)-4-(4-(difluoromethoxy)phenyl)-1-methyl-1H-imidazol-5(4H)-one | CHEMBL1270529
TypeSmall organic molecule
Emp. Form.C21H19F4N3O3
Mol. Mass.437.3875
SMILES[#6]-[#7]-1-[#6](-[#7])=[#7][C@]([#6]-1=O)(c1ccc(-[#8]-[#6](F)F)cc1)c1cccc(-[#8]-[#6]-[#6]\[#6]=[#6](\F)F)c1