Reaction Details
TargetDihydrofolate reductase
LigandBDBM26521
Substrate/Competitorn/a
Meas. Tech.ChEMBL_674962 (CHEMBL1272639)
Ki 320±n/a nM
Citation Beierlein, JMKarri, NGAnderson, AC Targeted mutations of Bacillus anthracis dihydrofolate reductase condense complex structure-activity relationships. J Med Chem53:7327-36 (2010) 
 
Dihydrofolate reductase
Name:Dihydrofolate reductase
Type:Enzyme
Mol. Mass.:19120.62
Organism:Bacillus anthracis
Description:baDHFR was expressed in E. coli BL21, and purified to homogeneity.
Residue:162
BDBM26521
NameBDBM26521
Synonyms:6-ethyl-5-[3-(3,4,5-trimethoxyphenyl)prop-1-yn-1-yl]pyrimidine-2,4-diamine | Propargyl inhibitor, 20
TypeSmall organic molecule
Emp. Form.C18H22N4O3
Mol. Mass.342.3923
SMILESCCc1nc(N)nc(N)c1C#CCc1cc(OC)c(OC)c(OC)c1