Reaction Details
TargetDihydrofolate reductase
LigandBDBM26519
Substrate/Competitorn/a
Meas. Tech.ChEMBL_674962 (CHEMBL1272639)
Ki 300±n/a nM
Citation Beierlein, JMKarri, NGAnderson, AC Targeted mutations of Bacillus anthracis dihydrofolate reductase condense complex structure-activity relationships. J Med Chem53:7327-36 (2010) 
 
Dihydrofolate reductase
Name:Dihydrofolate reductase
Type:Enzyme
Mol. Mass.:19120.62
Organism:Bacillus anthracis
Description:baDHFR was expressed in E. coli BL21, and purified to homogeneity.
Residue:162
BDBM26519
NameBDBM26519
Synonyms:5-[3-(2,5-dimethoxyphenyl)prop-1-yn-1-yl]-6-ethylpyrimidine-2,4-diamine Propargyl-linked, 11
TypeSmall organic molecule
Emp. Form.C17H20N4O2
Mol. Mass.312.3663
SMILESCCc1nc(N)nc(N)c1C#CCc1cc(OC)ccc1OC