Reaction Details
TargetProstaglandin E2 receptor EP3 subtype
LigandBDBM50417212
Substrate/Competitorn/a
Meas. Tech.ChEMBL_675685 (CHEMBL1274046)
Ki 1000±n/a nM
Citation Li, YHTseng, PSEvans, KAJaworski, JPMorrow, DMFries, HEWu, CWEdwards, RMJin, J 3-Urea-1-(phenylmethyl)-pyridones as novel, potent, and selective EP3 receptor antagonists. Bioorg Med Chem Lett20:6744-7 (2010) 
 
Prostaglandin E2 receptor EP3 subtype
Name:Prostaglandin E2 receptor EP3 subtype
Type:Enzyme
Mol. Mass.:43335.03
Organism:Homo sapiens (Human)
Description:P43115
Residue:390
BDBM50417212
NameBDBM50417212
Synonyms:CHEMBL1271743
TypeSmall organic molecule
Emp. Form.C20H18FN3O3
Mol. Mass.367.3736
SMILESCOc1cccc(NC(=O)Nc2cccn(Cc3cccc(F)c3)c2=O)c1